Allusers 1 Error

How to fix "insufficient privileges to access this directory" error

RECOMMENDED: If you have Windows errors then we strongly recommend that you download and run this (Windows) Repair Tool.

If UAC is enabled and the correct Admin credentials are not provided, the installation fails with an error stating that administrator privileges are required.

Install-Script returns an error if no script exists in the online gallery. Install-Script -Name Connect-O365 -MinimumVersion 1.1 -MaximumVersion 1.6.2 # Installing a script to default AllUsers scope and with RequiredVersion.

Feb 15, 2011. In the case of Adobe Acrobat Standard, one customer, David G, found a solution to the 1603 error by running the removing the ALLUSERS=1 Command Line ( using the Custom command line) in the Install Step and adding the Transforms= TransformFile.mst (which can also be added to the Paramters.

Loop through multiple domains. Add-Member -MemberType NoteProperty -Name DomainController -Value $domainController $allUsers+.

The US technology firm is urging all users to update their Macs to the latest.

Jun 13, 2006  · I get this error during.msi installation – But during installation this merge module gives an error: 1: ALLUSERS property is not 1 – the MSM cannot be.

Type Ii Error Wilcoxon Rank Sum −2.5. 0.0. 2.5. 5.0. Values. Density. Group. 1. 2. Density Assumption for t−Tests. Dan Spencer (UC Santa Cruz). Wilcoxon Test and Calculating Sample Sizes. Rank Sums. Horsebean. Weights Ranks. 266.84. 14. 264.07. 6. 263.82. 4. 263.47. 2. 264.33. 8. 264.25.

300/- Kindle e-Books promotion credit 1. From your registered mobile phone please give a. of India (or from a device with a non-India IP address) will receive an error message. 4) This Offer only applies to eligible digital content sold by.

Due to a bug in python-2.4.msi, installing into a target dir that has a space in its name causes the IDLE and pydoc shortcuts to fail. Installation for All Users. Adding ALLUSERS=1 causes an installation for all users. By default, the non- interactive installation install the package just for the current user, and the interactive.

Event Log Error 7011 SQL Server – Msg 22004, Level 16, State 1, Line 2 Failed to open loopback connection. Please see event log for more information. Msg 22004, Level 16, State 1, Line 2 Error log location not found. When trying to read

I don’t have any real-world experience with it as I’ve always used ALLUSERS=1. I just remember reading up on this a couple of years ago when researching a technical.

The security update is rolling out on the Mac App Store now, and it should be.

Error En Setup.exe Msjet35 Error Win 98 PHP :: Bug #12693 :: CGI Error Cotinued. futher info. – Snippets from log file: You can definately see where the 502 code occurs, I assume that means CGI Header Error. +AOL+6.0;+Windows+98;+Win+9x+4.90). CONFIGURING AND USING TRX-MANAGER.

Jun 22, 2012  · Error: Access Denied for all users. I have migrated to Sharepoint 2010 successfully but Search service wasn’t working every time I get system error.

We present and explore performance of several GHOST implemented algorithms using next-generation sequencing data experimentally obtained from.

On other systems, if the user does not have administrative privileges, the installation displays an error message and exits. a per-user installation. Project : This property is set to 1 in InstallScript MSI projects to help avoid ALLUSERS- related issues when the installation is run silently. The property can be overridden with the.

using XML data in DesktopX » Forum Post by Opper-Hooftman » Hi,I want to call some data from a xml file.my s

Perform a silent installation of BizTalk Server 2002. You must add the ALLUSERS=1 parameter to complete the installation for. 1) Error messages generated by.

May 27, 2013  · You can’t do a Just me install with that merge module in your project build because it requires an Everyone install. ALLUSERS=1 is.

Apr 11, 2017. BuildPath(InstallSource, LibreOfficeSetup) & """ /qb /norestart ALLUSERS=1 ISCHECKFORPRODUCTUPDATES=0 RebootYesNo=No REBOOT= ReallySuppress /l* """ & Temp & "LibreOffice_install_log.txt""" Set Products = WI. Products For Each Product In Products On Error Resume Next Name = WI.

I dnld’d DWG True View 2008 to my desktop. Then tried to install, following all directions. I have admin privileges. Each time I tried it, the

Windows Installer error during PI Coresight installation (when the PI. – Dec 12, 2011. The PI Coresight setup will display the following error during the AF Client 2.3.1 patch installation step when the setup kit is run on a machine that has PI AF 2010 R3 (2.4) already installed: Windows Installer: The upgrade patch cannot be installed by the Windows Installer service because the program to be.

Jan 8, 2010. Q: What is the difference between installations using ALLUSERS=””, ALLUSERS =1 and ALLUSERS=2 option?. If UAC is disabled by the registry key, group policy, or the control panel, the UAC dialog box is not displayed and the installation fails with an error stating that administrator privileges are.

RECOMMENDED: Click here to fix Windows errors and improve system performance

13. December 2017 by Aaron
Categories: Articles | Comments Off on Allusers 1 Error

Event Log Error 7011

How to Fix Event ID 7000 Error

RECOMMENDED: If you have Windows errors then we strongly recommend that you download and run this (Windows) Repair Tool.

SQL Server – Msg 22004, Level 16, State 1, Line 2 Failed to open loopback connection. Please see event log for more information. Msg 22004, Level 16, State 1, Line 2 Error log location not found. When trying to read the error log via SSMS (SQL.

Event ID 7031 — Service Stop Operations. Updated: December 11, 2007. Applies To: Windows Server 2008

Analogy: The Identity control policy can be analogous to an email management policy on a workstation application. Where ‘Event’ could be an email arriving.

Exchange Server 2010 customers sometimes ask why their server disk drive is filling up with log files. This article explains why.

It combines app performance metrics, errors, logs, and monitoring all into one.

Microsoft – e.event_type, e.end_time; The sys.event_log view offers information about.

How to Fix Service Control Manager Event Id 7031 Errors Windows operating system misconfiguration is the main cause of Service Control Manager Event Id 7031

Create a Post for that event. Offering a free report or white paper? Create a Post about that white paper and add the link to where people can go to download it.

Event Type: Error Event Source: Service Control Manager Event Category: None Event ID: 7000. The ServiceName service failed to start due to the following error: The service did not respond to the start or control request in a timely fashion. Event 2. Event Type: Error Event Source: Service Control Manager Event Category:.

View and Download Electronics Line CommPact installation manual online. CommPact Security System pdf manual download.

complete event logs/traps, operational errors prevention, and event logs, and operational errors exceeds IEC62443-4-2 Level 2 requirements to build most secure systems for industrial applications. – Advanced Port Based Security.

Aug 15, 2016. They said that they are seeing below error in the System Event log and during that time they were not able to connect to SQL Server. Event ID: 7011. Message: A timeout (30000 milliseconds) was reached while waiting for a transaction response from the MSSQLSERVER service. Once it happens, they were.

Hello, After Installing CSRSS Patch, SideBySide Error with EVentID:33 appears in Windows Event Viewer. Error Mesage: " Activation Context generation failed for "C.

Type Ii Error Wilcoxon Rank Sum −2.5. 0.0. 2.5. 5.0. Values. Density. Group. 1. 2. Density Assumption for t−Tests. Dan Spencer (UC Santa Cruz). Wilcoxon Test and Calculating Sample Sizes. Rank Sums. Horsebean. Weights Ranks. 266.84. 14. 264.07. 6. 263.82. 4. 263.47. 2. 264.33. 8. 264.25.

Event ID 7026 — Basic Service Control Manager Operations. Updated: December 11, 2007. Applies To: Windows Server 2008

Mar 5, 2016. I was taken aback by the sheer number of errors and warnings which were being logged in the Windows System log (use Event Viewer to check) during. Error, Service Control Manager, 7011, A timeout (30000 milliseconds) was reached while waiting for a transaction response from the netprofm service.

If you dig down deeper, you will find errors in your Windows Event Logs with.

Luxriot is a new-generation piece of security and video surveillance software, offering a fast and scalable stand-alone multiple-server solution

Jun 23, 2016. Service Control Manager System Event Error-7011. A timeout (30000 milliseconds) was reached while waiting for a transaction Response from the SessionEnv service. Event ID : 7011. Service Name : System Error. Error Message : A timeout (30000 milliseconds) was reached while waiting for a transaction.

Wood Storage Sheds Tucson – 12×10 Shed Kit Wood Storage Sheds Tucson Build Shed From 4 Doors How To Build A Storage Unit Business

Step-By-Step Instruction: How to Easily Repair Error 7011 Problems.

RECOMMENDED: Click here to fix Windows errors and improve system performance

13. December 2017 by Aaron
Categories: Articles | Comments Off on Event Log Error 7011

Msjet35 Error Win 98

If TF2 Ran On Windows 98.

RECOMMENDED: If you have Windows errors then we strongly recommend that you download and run this (Windows) Repair Tool.

PHP :: Bug #12693 :: CGI Error Cotinued. futher info. – Snippets from log file: You can definately see where the 502 code occurs, I assume that means CGI Header Error. +AOL+6.0;+Windows+98;+Win+9x+4.90).

CONFIGURING AND USING TRX-MANAGER. Some of the toolbars disappear. Exit the program and delete the Toolbar directory (in the.

How To Fix Msjet35.dll Errors – Windows Wally – Reader Question: “Hi Wally, How do I fix the Msjet35.dll error, it appears when I try to start windows, and sometimes when I install something.” – Aaron F., United Kingdom. Before addressing any computer issue, I always recommend scanning and repairing any underlying problems affecting your PC health and performance :.

Ora-00604 Error Occurred At Recursive Sql Could you tell me how to suppress "ORA-00604: error occurred at recursive SQL level 1" when I raise application error using "RAISE_APPLICATION_ERROR". I am using it. Learn how to fix Oracle ORA-00604: Error Occurred at Recursive SQL Level String from

Do NOT replace ANY of these original Win98 SE system files with their WinME counterparts because your Windows OS WILL STOP WORKING OR LOCK UP IF YOU. BUG: No matter which system files I did (or did NOT) replace, I canNOT properly reinstall Win98 SE into the SAME directory IF already installed ANY MS.

#WIN) Download` iMacsoft VOB to iPad Converter for Mac serial key (downloads)

Jun 30, 2012. If that doesn't work. you have to move the dll file to the system directory. ( Windows XP, Vista, Windows 7) – C:WindowsSystem32; (Windows NT/2000) – C :WINNTSystem32; (Windows 95/98/Me) – C:WindowsSystem. If you use a 64 bit version of Windows, The System Directory in C:WindowsSysWOW64.

#WIN( Review+ Video Chat Plug-In (Public) for 5 broadcasters full version (reviews)

Yash, can you comment on these errors I found in my log files from last night. 2004-04-02 10:07:15 61.25.50.22 – W3SVC405 FORM-TI1SWLDILP.

msjet35.dll free download | DLL-files.com – msjet35.dll, File description: Microsoft Jet Engine Library. For instance, a faulty application, msjet35.dll has been deleted or misplaced, corrupted by malicious software present on your PC or a damaged Windows. The DLL-files.com Client can help you properly install msjet35.dll and fix your DLL error permanently.

Aug 22, 2012  · SubInACL is a command-line tool that enables administrators to obtain security information about files, registry keys, and services, and transfer this.

RECOMMENDED: Click here to fix Windows errors and improve system performance

13. December 2017 by Aaron
Categories: Articles | Comments Off on Msjet35 Error Win 98

Type Ii Error Wilcoxon Rank Sum

STATISTICS I Intuition Of The Wilcoxon Rank Sum Test I Example

RECOMMENDED: If you have Windows errors then we strongly recommend that you download and run this (Windows) Repair Tool.

−2.5. 0.0. 2.5. 5.0. Values. Density. Group. 1. 2. Density Assumption for t−Tests. Dan Spencer (UC Santa Cruz). Wilcoxon Test and Calculating Sample Sizes. Rank Sums. Horsebean. Weights Ranks. 266.84. 14. 264.07. 6. 263.82. 4. 263.47. 2. 264.33. 8. 264.25. 7. 263.22. 1. 263.92. 5. Sum = 47. Sunflower. Weights Ranks.

Analyst – In doing so, it sent NFV development off in the wrong direction — an error from which the industry hasn’t recovered. "People constantly assured me it was only a functional diagram and wasn’t intended to show how the software would really be.

Calculating the Power Function of the Wilcoxon Rank Sum Test in 2xK Tables. Ii ± 1.96J p (1 :; P) (3) The. type 1 error rate in large samples.

. Comparative Power of the t-test and Wilcoxon Rank-Sum Test in Small Samples Applied Research. that even if a test is robust with respect to Type II errors,

Error En Setup.exe Msjet35 Error Win 98 PHP :: Bug #12693 :: CGI Error Cotinued. futher info. – Snippets from log file: You can definately see where the 502 code occurs, I assume that means CGI Header Error. +AOL+6.0;+Windows+98;+Win+9x+4.90). CONFIGURING AND USING TRX-MANAGER.

Example 15-3. 15-2 Sign Test. 15-2.3 Type II Error for the Sign Test. Figure 15-1 Calculation of for the sign test. (a) Normal distributions. (b) Exponential distributions. 15-3 Wilcoxon Signed-Rank Test. The Wilcoxon signed-rank test applies to the case of symmetric continuous distributions. Under this assumption, the mean.

Most guides to choosing a t-test or non-parametric test. (otherwise you're letting type II error. Comparative Power of the t-test and Wilcoxon Rank-Sum.

3: Nonparametric tests 3.1. means that there is an increased chance of a Type II error. The Wilcoxon Signed-Rank Test 3.2.1.

Oct 29, 2014. However, there's a good argument for using higher type I error rates with small samples (otherwise you're letting type II error rates inflate while holding type I. *(Wilcoxon's name is associated with both the one and two sample rank tests – signed rank and rank sum; with their U test, Mann and Whitney.

Significance thresholds were drawn based on the 2.5 and 97.5 percentile of the empirical distribution of normalized FR.

Mann-Whitney-Wilcoxon Test | R Tutorial – An R tutorial of performing statistical analysis with the Mann-Whitney-Wilcoxon test. Wilcoxon rank sum test with. Type II Error in Lower Tail Test.

The Wilcoxon rank-sum test was performed as the primary analysis if there.

The multicenter, placebo-controlled phase II study was designed to evaluate the safety and efficacy of KRN5500 for treatment of neuropathic pain in patients with cancer. Management used the Wilcoxon Rank Sum test to compare.

Problems 9.4 through 9.6 give you summary values, not. -5. -4. -3. -2. -1. 3. 2. 1. Occurrences. 1. 3. 2. 2. 1. 5. 4. 4. 2. 6. 10. Choose STAT/NONPARAMETRICS/ WILCOXON SIGNED. RANKS (as shown on the right). POWER than the Signed-Ranks Test, meaning that you have more of a chance of making a TYPE II error,

Type I and type II errors In statistical hypothesis testing, a type I error is the incorrect rejection of a true null hypothesis (also known as a "false positive.

STATISTICS 2 – STA 3123. STA 3123 STATISTICS II. STUDY. The independent T-Test is to the Wilcoxon Rank Sum Test, Type II error.

In statistics, the Mann–Whitney U test (also called the Mann–Whitney–Wilcoxon ( MWW), Wilcoxon rank-sum test, or Wilcoxon–Mann–Whitney test) is a nonparametric test of the null hypothesis that it is equally likely that a randomly selected value from one sample will be less than or greater than a randomly selected value.

May 28, 2008. Power and sample size estimation for the Wilcoxon rank sum test with application to comparisons of C statistics from alternative prediction models. In this article, we present an approach for estimating type II error, which is applicable to any continuous distribution, and also extend the approach to handle.

Pegfilgrastim after high-dose chemotherapy and autologous peripheral blood stem cell transplant: phase II study – Groups with continuous variable outcomes were compared using Wilcoxon’s rank-sum test, when data distribution was.

. Comparative Power of the t-test and Wilcoxon Rank-Sum Test in Small Samples Applied Research. that even if a test is robust with respect to Type II errors,

RECOMMENDED: Click here to fix Windows errors and improve system performance

13. December 2017 by Aaron
Categories: Articles | Comments Off on Type Ii Error Wilcoxon Rank Sum

Ora-00604 Error Occurred At Recursive Sql

Java EE (J2EE) Tutorial for beginners Part11 - Oracle database setup and connection

RECOMMENDED: If you have Windows errors then we strongly recommend that you download and run this (Windows) Repair Tool.

Could you tell me how to suppress "ORA-00604: error occurred at recursive SQL level 1" when I raise application error using "RAISE_APPLICATION_ERROR". I am using it.

Learn how to fix Oracle ORA-00604: Error Occurred at Recursive SQL Level String from one of our top Oracle database DBA experts.

ORA-01400: cannot insert NULL into ("SYS"."AUDIT_DDL"."DICT_OBJ_TYPE") tips. Oracle Database Tips by Donald BurlesonJuly 11, 2015

Oracle SQL Error: ORA-04052 error occurred when looking. – Oracle: Trying to use a package via db-link ends in a ORA-04052 ! Deutsch/German ORA-04052 Error ORA-04052: Fehler beim Aufsuchen von Fern-Objekt PUBLIC.UITL

3 Error Beeps Imac Xp Sp2 Install Error Using this makefile, and this patch, I successfully compiled Samba under Windows. Here are the steps to run Samba 3.0.23c under Windows XP Pro SP2. If you have to reinstall Windows XP on your computer and

ORA-00604 occurs while processing a recursive SQL statement. If the situation described in the next error on the stack can be corrected, it should be corrected.

On this forum, a user finds ORA-00604 after attempting to run a newly created table using select*from cdc; The message they are receiving is:

Dear Friends, I am facing the following SQL error.I am attaching the log of that error.Please suggest me.trc file: "dev_w0", trc level: 1, release: "640"-* ACTIVE.

I am getting the following error: ORA-00604:error occurred at recursive sql level 1. This error occurred when I was trying to connect to the database user. But if I grant DBA role, that user is able to connect. System user is able to connect but scott is not able to connect. Oracle does a lot of work behind the scenes for you.

Jul 1, 2013. ERROR at line 1: ORA-00604: error occurred at recursive SQL level 1. ORA- 04092: cannot COMMIT in a trigger. ORA-06512: at line 12. ORA-00942: table or view does not exist. And table `t' does not exist. But this happens no matter what user I am, no matter what I do but only if there are errors (assuming.

May 27, 2015. One possible explanation is a database trigger that fires for each DROP TABLE statement. To find the trigger, query the _TRIGGERS dictionary views: select * from all_triggers where trigger_type in ('AFTER EVENT', 'BEFORE EVENT'). disable any suspicious trigger with alter trigger <trigger_name> disable.

Hi All,I have just rebuilt an existing application server, the setup I have now is a database server with oracle and two application servers. The problem I am having.

When I'm trying to drop table then I'm getting error SQL Error: ORA-00604: error occurred at recursive SQL level 2 ORA-01422: exact fetch returns more than requested.

RECOMMENDED: Click here to fix Windows errors and improve system performance

13. December 2017 by Aaron
Categories: Articles | Comments Off on Ora-00604 Error Occurred At Recursive Sql

Error En Setup.exe

SETUP.EXE IS STOPED WORKING error fix

RECOMMENDED: If you have Windows errors then we strongly recommend that you download and run this (Windows) Repair Tool.

Msjet35 Error Win 98 PHP :: Bug #12693 :: CGI Error Cotinued. futher info. – Snippets from log file: You can definately see where the 502 code occurs, I assume that means CGI Header Error. +AOL+6.0;+Windows+98;+Win+9x+4.90). CONFIGURING AND USING TRX-MANAGER. Some of the toolbars

"This was the best support I have ever received.thank you it worked like a charm keep up the good work." – Freddie, via comments.

I have an Asus f3sv with vista home premium (32bit). I am Trying to install Windows 7 Ultimate (32 bit) During "setup is copying files" I get "Windows setup.

setup.exe is not essential for Windows 10/8/7/XP and will often cause problems. Click here to see what setup is doing, and how to remove setup.exe.

3 Error Beeps Imac Xp Sp2 Install Error Using this makefile, and this patch, I successfully compiled Samba under Windows. Here are the steps to run Samba 3.0.23c under Windows XP Pro SP2. If you have to reinstall Windows XP on your computer and

Describes an issue that triggers an error during SharePoint 2013 or Project Server 2013 Setup if the.NET Framework 4.6 is installed. Provides a workaround.

Jun 27, 2017. Fixes an issue in which you receive an error when you run setup.exe as a member of "Delegated Setup" group in an Exchange Server 2013 environment.

Ora-00604 Error Occurred At Recursive Sql Could you tell me how to suppress "ORA-00604: error occurred at recursive SQL level 1" when I raise application error using "RAISE_APPLICATION_ERROR". I am using it. Learn how to fix Oracle ORA-00604: Error Occurred at Recursive SQL Level String from

Windows has a tendency to accumulate errors and problems over time. While some of this virtual wear and tear can be.

Read about some error messages that you might see when you are setting up Office 2010 using Click-to-Run and things you can try to fix the problem.

"Error 0 running command Setup.exe" message when trying to. – I have recently had to change from Vista Ultimate 64bit to Win 7 64bit Home premium. I used the EpsonScan utility a great deal and now find that I am unable to.

Setup.exe Run-Time Errors and Warnings. InstallShield 2015 Express Edition. The table below lists the errors that you may encounter when running Setup.exe. You can trap these return values when you call CreateProcess() to launch Setup. exe. However, Setup.exe does not return error codes from MsiExec.exe.

Aug 22, 2012  · SubInACL is a command-line tool that enables administrators to obtain security information about files, registry keys, and services, and transfer this.

Error "Error during execution ""Setup.exe" /PatchMode=1 /PatchProduct=Symantec Control Compliance Suite – R and A", operation was cancelled by user" during.

Trying to install a service pack update on my PC at work and I'm getting the below error. Dassault sent me the link for the update, I downloaded it, extracted it to the desktop into a folder, and am now trying to run the setup.exe file (even tried as " run as adminstrator"). Any ideas? I have SW closed down when.

I'm trying to install windows however whenever my PC restart I always get the same response "setup.exe – application error" Original title :what does.

Whenever i try to Install my video games onto my vista it goes inot setup and then it displays a message saying: Setup has detected that Uninstallshield is in use.

How to Fix Setup.Exe Errors. The error code show up on your computer screen as numbers or number/letter combinations that correspond to the particular error or.

May 31, 2010  · cosp: Could you provide the exact model of your dell xps ? and bios version if possible. thanks

RECOMMENDED: Click here to fix Windows errors and improve system performance

13. December 2017 by Aaron
Categories: Articles | Comments Off on Error En Setup.exe

3 Error Beeps Imac

How to Change RAM on a Apple iMac and the three beeps hardware problem

RECOMMENDED: If you have Windows errors then we strongly recommend that you download and run this (Windows) Repair Tool.

Xp Sp2 Install Error Using this makefile, and this patch, I successfully compiled Samba under Windows. Here are the steps to run Samba 3.0.23c under Windows XP Pro SP2. If you have to reinstall Windows XP on your computer and it is a version

Here is the link to the lights flashing. http://support.apple.com/kb/HT2811 And here are the beeps. Good luck. Ralph http://support.apple.com/kb/HT1547 – Mac.

I bought a wiped iMac. When I tried to put on Snow Leopard, it continuously beeps three times and stays on the apple icon, no swirling icon. – iMac

3 beeps indicate GPU (video chip) issue. A reflow (heating of the solder balls under the GPU at around 250 degrees) could fix the problem temporary but in order to have a permanent result you need to remove the GPU and replace the solder balls (reballing). If you intent to do just a reflow you will definitelly.

3. I didn’t bring a lunch to work with me. 4. My car was already running very low on gas. But I am resourceful and I am a technologically capable man about town in the year 2017. So this should be no problem, right? I have an iPhone and I.

If you bought your iMac 3-5 years ago, there’s probably nothing so seriously wrong with the hardware that you need to consider replacing the machine. Sure, the new.

But since the iMac shut down i get no beeps at all and it. specifically about the "3 long beeps, 3 short. as yours is/was–the same error beep.

[SOLVED] 1 long beep 3 short problem. – Tech Support Forum – Jun 08, 2011  · [SOLVED] 1 long beep 3 short problem. This is a discussion on [SOLVED] 1 long beep 3 short problem. within the Motherboards, Bios &.

Dec 22, 2009. Apple Computer Beep Codes. Tone(s) = Description. 1 tone, a 5-second pause, repeat = No RAM installed; 3 successive tones, a 5-second pause, 3 successive tones = RAM does not pass data integrity check; 1 long tone when holding down the power button = Firmware upgrade in process. 3 long tones, 3.

They can use ECC (error-correcting code) RAM. Also new are "50% faster" storage options and two Thunderbolt 3 ports. The 27-inch iMac also has a new.

Tcpserver Error Address Already In Use – Bind2 Mar 2, 2016. foreman-proxy[1282]: TCPServer Error: Address already in use – bind(2) Apr 19 16:44:26 fdi foreman-proxy[1282]: Certificate: Data: Version: 3 (0x2) Serial Number: 11086402602131776804 (0x99dad06da907e524) Signature Algorithm: sha256WithRSAEncryption Issuer: CN=192.168.100.10 Validity Not. When starting WEBrick/Jekyll it produces a TCPServer

★★ Windows Update Error Error 0x8024200b ★★ Fix, Clean [ WINDOWS UPDATE ERROR ERROR 0X8024200B ] And Optimize PC! SPEED Up Your PC FREE Scan Now! (Recommended).

Hey guys Just came home from work and turn my iMac on and it made three beeps.like beep beep beep.pause and so on. Am I screwed? Please help!.

MacBook Pro. Apple's line of MacBook Pro laptops was intended for the professional and power users. The MacBook Pro line includes the MacBook Pro 13" Unibody, MacBook Pro 15", MacBook Pro 15" Unibody, MacBook Pro 17", and the MacBook Pro 17" Unibody. beep codes · 11679 Questions View all.

Hey Matt, I'm having similar issues with an early 2008 24" iMac. I get two sets of beeps depending on the type of ram installed. With the old Samsung ram I get three.

That means that Apple is buying Shazam’s 125-million-plus users for about $3.20.

Apple seems to only have a couple of different beep codes. I seem to be getting the same 3 beep code and the single beep code. I recently removed the logic board from my iMac (2013 slim model) to install a wall mount. When i put everything back together it booted up without pressing the power button.

However, you better have some money saved up because starting at $5,000, this.

RECOMMENDED: Click here to fix Windows errors and improve system performance

12. December 2017 by Aaron
Categories: Articles | Comments Off on 3 Error Beeps Imac

Tcpserver Error Address Already In Use – Bind2

C# Socket Programming - Multiple Clients

RECOMMENDED: If you have Windows errors then we strongly recommend that you download and run this (Windows) Repair Tool.

Mar 2, 2016. foreman-proxy[1282]: TCPServer Error: Address already in use – bind(2) Apr 19 16:44:26 fdi foreman-proxy[1282]: Certificate: Data: Version: 3 (0x2) Serial Number: 11086402602131776804 (0x99dad06da907e524) Signature Algorithm: sha256WithRSAEncryption Issuer: CN=192.168.100.10 Validity Not.

When starting WEBrick/Jekyll it produces a TCPServer Error (Address already in use) 236. Heroku + node.js error.

Puppet Master: TCPServer Error: Address already in use – bind. – I rebooted Puppet Master several times but always this error [[email protected] ~]# service httpd restart Stopping httpd.

Is it unethical of me and can I get in trouble if http://stackoverflow.com/questions/10261477/tcpserver-error-address-already-in-use-bind2 is, Restart my machine.

Home > address already > tcpserver error address already in use – bind2 exiting Tcpserver Error Address Already In Use – Bind2 Exiting. here for a quick address.

Nov 2, 2015. It looks like you are trying to start puppet master twice: first from httpd , where I presume you are using passenger to start the puppetmaster; secondly to start the puppet master service directly. Since you don't know what you want :), I would ask the person who installed it to tell you which one is correct.

Dec 27, 2016. https://www.theforeman.org/manuals/1.13/index.html#2.1Installation. It seems everything works from the functional view. but i get a warn message in the foreman smart-proxy log: puppet TCPServer Error: Address already in use – bind( 2). this happens on every server start. does anyone know what this Error.

Xp Sp2 Install Error Using this makefile, and this patch, I successfully compiled Samba under Windows. Here are the steps to run Samba 3.0.23c under Windows XP Pro SP2. If you have to reinstall Windows XP on your computer and it is a version

2012年1月12日. 13:49:02] INFO WEBrick 1.3.1 [2012-01-12 13:49:02] INFO ruby 1.9.3 (2011-10 -30) [x86_64-darwin11.2.0] [2012-01-12 13:49:02] WARN TCPServer Error: Address already in use – bind(2) Exiting /Users/shiori/.rvm/rubies/ruby-1.9.3-p0/lib /ruby/1.9.1/webrick/utils.rb:85:in `initialize': Address already in use.

Apr 21, 2012. Type this in your terminal to find out the PID of the process that's using the 3000 port: $ lsof -wni tcp:3000. Then, use the number in the PID column to kill the process: $ kill -9 PID.

Email codedump link for TCPServer Error: Address already in use – bind(2) Email has been send. To emailaddress: To name: From name: Extra.

Error 501 Xdrive Listings 1 – 15 of 1500. Save $9330 on a 2011 BMW 3 Series 328i xDrive Sedan AWD. Search over 32500 listings to find the best local deals. CarGurus analyzes over 6 million cars daily. Browse used cars with ZAMBESI
Rca Mp3 Player Boot Error Please Format Unit PACKING GUIDE. 1. Main Unit(Player). 2. Wireless Microphone x 2. 3. Remote Control. 4. Song list & Manual & Quick Guide. 5. Auto-Volt Power Adaptor. 6. main player. 2. Please connect only one video cable between HDMI and RCA in

Apr 30, 2015. Trouble running Jekyll after the server fails to stop properly.

ruby – TCPServer Error: Address already in use – bind(2. – Jekyll was working fine for me few weeks back but now all of a sudden it gives me the following error: TCPServer Error: Address already in use – bind(2) INFO WEBrick.

RECOMMENDED: Click here to fix Windows errors and improve system performance

12. December 2017 by Aaron
Categories: Articles | Comments Off on Tcpserver Error Address Already In Use – Bind2

Xp Sp2 Install Error

Install Windows XP Service Pack 3 update

RECOMMENDED: If you have Windows errors then we strongly recommend that you download and run this (Windows) Repair Tool.

Using this makefile, and this patch, I successfully compiled Samba under Windows. Here are the steps to run Samba 3.0.23c under Windows XP Pro SP2.

If you have to reinstall Windows XP on your computer and it is a version before Service Pack 2 (SP2), you may want to reinstall this service pack to make your computer more secure. Fortunately, you can download SP2 from Microsoft.

Error 501 Xdrive Listings 1 – 15 of 1500. Save $9330 on a 2011 BMW 3 Series 328i xDrive Sedan AWD. Search over 32500 listings to find the best local deals. CarGurus analyzes over 6 million cars daily. Browse used cars with ZAMBESI

Jan 7, 2017. Provides information about an issue that may occur when registry permissions prevent you from installing Windows XP Service Pack 2 (SP2).

[Fix] Windows XP SP3 Setup Error: Cannot Update a Checked. – [Fix] Windows XP SP3 Setup Error: Cannot Update a Checked (Debug) System with a Free (Retail) Version of Service Pack 3 – As we all know Microsoft has released the final version of Windows XP SP3 to public and its available via Automatic Updates, Windows Updates and Downloads.

Several programs can cause this inability to backup atapi.sys when trying to install SP2. This tutorial explains the error and how to correct it. Multiple people are.

I have disabled ACPI in the BIOS but to no avail. Install is from a Original XP SP2 Axiz CD. Tried another CD, same error. We have about 40 of these machines and this is the only one giving this error.

but they may need to install the ODBC driver or OLE DB provider that is required to access the external data on their computers. Microsoft Data Access Components (MDAC) 2.8 is included with Windows Server 2003 and Windows XP.

9 Critical Errors that Will Prevent the Installation of XP SP3 RTM Build 5512 – According to Microsoft, Mac Pro, Mac Mini, MacBook, MacBook Air, MacBook Pro and iMac computers with Intel processors running XP SP2 may spit of the "Out of Disk Space" error message when the user will attempt to install.

firewall/internet connection sharing (ics) service. – Nov 12, 2017  · I asked this question in the "Netwworking, Mail." Forum and it was suggested that I post here. I think this is a somewhat frequent problem but I can’t.

During the Windows XP (SP2) installation. The following error message appears unless proper pre-configuration steps are taken: The following actions are specific to Fedora Core: $ yum update kernel $ yum install kernel-devel gcc You.

Go to the Italian version of this page. Table of contents. Read this first. Can Service Pack 2 be installed on all XP installations? Ordering the service pack on a CD

Rca Mp3 Player Boot Error Please Format Unit PACKING GUIDE. 1. Main Unit(Player). 2. Wireless Microphone x 2. 3. Remote Control. 4. Song list & Manual & Quick Guide. 5. Auto-Volt Power Adaptor. 6. main player. 2. Please connect only one video cable between HDMI and RCA in

That copy only came with Service Pack 2, and that's proving to be a problem. Most programs won't install or run without Service Pack 3. I can't download it from Microsoft since they don't care about XP anymore, so I downloaded it from another source. At first it was giving me an error about not being able to.

Jul 24, 2005. Note – the issue described in this blog post was originally presented as an issue on Windows XP SP2. However, it can also affect.NET Framework 1.0 and 1.1 installation on any OS released after the.NET Framework 1.0 and 1.1 shipped – specifically, I have seen reports of this issue on Windows Vista.

Installing Windows XP on the Asus EEE pc using a single USB flash drive. Please note this tutorial works on all computers not just the Asus EEE PC.

Aug 1, 2008. Java Installation Error (XP SP2) – Trying to install Java 6. Whether I try to install on-line or off, I get the same error message: "Error- Java Installer" "The installer.

I am installing windows xp sp2 on new hard drive and got the following error: Setup can not copy the file: usrshuta.exe. How do I get around this?

A Windows XP clean install tutorial including screenshots and complete instructions. A clean install of Windows XP is almost always the best way to go.

Archived from groups: microsoft.public.windowsxp.configuration_manage (http://www.tomshardware.com/site/forums-usenet-faq.html)I am getting this message "unable to.

RECOMMENDED: Click here to fix Windows errors and improve system performance

12. December 2017 by Aaron
Categories: Articles | Comments Off on Xp Sp2 Install Error

Error 501 Xdrive

HP Bios Application Error (501) - Solution (rozwiązanie)

RECOMMENDED: If you have Windows errors then we strongly recommend that you download and run this (Windows) Repair Tool.

Listings 1 – 15 of 1500. Save $9330 on a 2011 BMW 3 Series 328i xDrive Sedan AWD. Search over 32500 listings to find the best local deals. CarGurus analyzes over 6 million cars daily.

Browse used cars with ZAMBESI AUTO in Pretoria

Hot spots Hot spots Hot spots Hot spots. 1 tudor watch movements; 2 zenith watch logo history 2017-2018

2015 BMW 3 Series 328d xDrive Sedan AWD For Sale – CarGurus – Listings 1 – 15 of 63. Save $11173 on a 2015 BMW 3 Series 328d xDrive Sedan AWD. Search over 32700 listings to find the best local deals. CarGurus analyzes over 6 million cars daily. 2016 BMW 3 Series 328d xDrive Sedan AWD. Good Deal. $4,598 BELOW. CarGurus IMV of $31,498. Price: $26,900 $501/mo est.

Autoblog Sitemap – Find your way through Autoblog’s comprehensive coverage of the U.S. and foreign auto industries by automaker, vehicle type and body style.

Solution: I have used Notepad ++ to find these type of errors successfully. If I have access to the mime file I just open it in notepad ++ and can easily spot

Sep 19, 2017. Used 2014 BMW 750Li xDrive, from BMW of Houston North in Houston, TX, 77090. (126.4"); Exterior body width: 1,902mm (74.9"); Engine bore x stroke: 89.0mm x 88.3mm (3.50" x 3.48"); Rear headroom: 988mm (38.9"); Front legroom : 1,046mm (41.2"); Interior maximum cargo volume: 501 L (18 cu.ft.).

I think that has somethng to do with iTunes unable to connect to its sever. Make sure that itunes is a exception in your firewall(s). – iPhone 5

Dec 4, 2017. Wheelbase: 3,211mm (126.4"); Exterior body width: 1,902mm (74.9"); Engine bore x stroke: 89.0mm x 88.3mm (3.50" x 3.48"); Rear headroom: 988mm (38.9"); Front legroom: 1,046mm (41.2"); Interior maximum cargo volume: 501 L (18 cu.ft.) Exterior length: 5,215mm (205.3"); Engine displacement: 4.4 L.

Error 3906 is raised when a transaction, explicit or implicit, is attempted while the database is in read-only mode. Attempted to start a subordinate transaction.

4 BMW 501 de segunda mano en venta en AutoUncle. Encuentra el BMW 501 más barato y prueba nuestra tasación de manera gratuita.

Rca Mp3 Player Boot Error Please Format Unit PACKING GUIDE. 1. Main Unit(Player). 2. Wireless Microphone x 2. 3. Remote Control. 4. Song list & Manual & Quick Guide. 5. Auto-Volt Power Adaptor. 6. main player. 2. Please connect only one video cable between HDMI and RCA in
Error Aspx Errortext Cannot Complete This Action 0a 0aplease Try Jul 3, 2015. When I create an item in the list, it always display error message. Cannot complete this action. please try again. But other list works fine in the same site. The ULS displays error message. Application error when

While the styling for the Sonata has been a home run in the United States, the Korean market initially was turned off by what some buyers might say is the car’s audacious design language, which Hyundai calls "fluidic sculpture. Simply,

EDITOR-IN-CHIEF Hillary Latos ASSISTANT EDITOR Tash Bazika CULTURE EDITOR Joe Alexander SPECIAL CORRESPONDENT George Wayne SOCIAL COLUMNIST Clara Morgan EDITORIAL ASSISTANT Corinne O’Connor.

Shop from the world’s largest selection and best deals for Car & Truck Light Bulbs. Shop with confidence on eBay!

At John Clark Motor Group, we have a great selection of used cars for sale in Scotland. Our dealers in Aberdeen, Dundee, Edinburgh and Perth represent a wide range of.

Tool errors and warnings: 501-525: Release 9.3 Related Topics Understanding geoprocessing tool errors and warnings; Note: This topic was updated for 9.3.1.

While sending mail through php I am getting below error- 501 Syntax error – line too long The following SMTP error was encountered: 501 Syntax error – line too long.

RECOMMENDED: Click here to fix Windows errors and improve system performance

12. December 2017 by Aaron
Categories: Articles | Comments Off on Error 501 Xdrive

← Older posts