Error Ora-00001 Unique Constraint Violated

RECOMMENDED: If you have Windows errors then we strongly recommend that you download and run this (Windows) Repair Tool.

rem See http://www.sqlsnippets.com/en/topic-13434.html for details. set NLS_LANG=.AL32UTF8. chcp 65001. rem show raw error messages from sqlplus.

Job Intervals: Execute daily ‘SYSDATE + 1’ Execute once per week ‘SYSDATE + 7’ Execute hourly ‘SYSDATE + 1/24’ Execute every 10 min. ‘SYSDATE + 10/1440’

ORA-00001: unique constraint violated. (unique) key. This error will also be generated if an existing record is updated to generate a duplicate (unique) key.

When doing a batch insert you may receive data from a host of external locations. While it’s nice to assume that the data has been scrubbed and validated, there.

What is import/export and why does one need it? Oracle’s export (exp) and import (imp) utilities are used to perform logical database backup and recovery.

Sys Utl File Error Below is the code i use to extract data from a table to a flat file. BEGIN DECLARE file_name VARCHAR2(50); file_handle utl_file.file_type; BEGIN. No Debugger Error Improve Computer Performance and Diagnose & Repair in Minutes. Another device told us it

Learn the cause and how to resolve the ORA-00001 error message in. ORA-00001: unique constraint. If you are not sure which unique constraint was violated,

I am trying to insert some values in table throught the application and get issue ORA-00001: unique constraint violated. I see that sequences are out of sync with the.

ORA-00001: unique constraint (string.string) violated tips – ORA-00001: unique constraint (string. Oracle docs note this action when you get a ORA-00001 error:. "when a unique constraint is violated the row is NOT.

oracle – ORA-00001: unique constraint primary key violated. – Here is the SQL part and I am getting an ORA-00001: unique constraint primary key violated. ORA-00001: unique constraint violated. unique constraint error ORA.

Apr 7, 2017. SQLIntegrityConstraintViolationException: ORA-00001: unique constraint ( ABC_RULES. PR_INDEX_REFERENCE_PK ) violated. While running the upgrade.sh we are receiving the below error; kindly verify and help us.

ORA-12012: error on auto execute of job 2182370 ORA-12008: error in materialized view refresh path ORA-00001: unique constraint (TE.

Cause: Either the session specified does not exist or the caller does not have the privilege to access it.

Jan 19, 2017. Error nhiReplDriver Pgm nhiReplDriver: Database error: (ORA-00001: unique constraint ({SID}.NH_ELEMENT_IX2) violated. This occurs when.

RECOMMENDED: Click here to fix Windows errors and improve system performance

18. October 2017 by Aaron
Categories: Articles | Comments Off on Error Ora-00001 Unique Constraint Violated

Error Unmarshalling Return Rmi

RECOMMENDED: If you have Windows errors then we strongly recommend that you download and run this (Windows) Repair Tool.

我是用RMI进行通讯,一个软件是anylogic用来仿真的,现在想从anylogic传数据 出来,用到了RMI,不过刚搭建好的时候通信通过一次,后来一直.

error unmarshalling return; nested exception is: java.lang.ClassNotFoundException:AnalyzerLogicAdd (no security manager: RMI class loader disabled)

Paradise, Mount Rainier National Park — For all its breathtaking beauty, Mount Rainier is a massive creature, a noisy, moving, steaming mass of rock, ice and tectonic energy, and if you want to know it as one who has climbed it, the.

Resolved Problems – Oracle – Resolved Problems. The following sections describe problems that have been resolved by Service Packs for WebLogic Server 6.1. Service Packs are cumulative; the.

I get this execption when I try to access the RMI serevr from action. java.rmi.UnmarshalException: error unmarshalling. error unmarshalling return;.

The S&P 500 Total Return Index, for example, has suffered non-overlapping drawdowns of -10% or worse 29 times from 1935 through 2013, a frequency of once every 2.7 years on average. RMI attempts to take traditional portfolio.

Arithmetic Overflow Error Decimal Error Ora-00001 Unique Constraint Violated rem See http://www.sqlsnippets.com/en/topic-13434.html for details. set NLS_LANG=.AL32UTF8. chcp 65001. rem show raw error messages from sqlplus. Job Intervals: Execute daily ‘SYSDATE + 1’ Execute once per week ‘SYSDATE + 7’ Execute hourly ‘SYSDATE + 1/24’

This document is the API specification for the Java™ Platform, Standard Edition.

I'm running the program here on 2 JVMs on diff physical machines. I get the error RemoteException java.rmi.UnmarshalException: error unmarshalling return; nested.

Winamp Directsound Buffer Error Error creating direct Sound Buffer Winamp Technical Support The free customizable Winamp media player that plays mp3 + other audio files, syncs your iPod, subscribes. MarkRH’s Winamp Configuration and Plug-In List Two security alerts were issued yesterday concerning vulnerabilities in

Discussions. EJB design: java.rmi.UnmarshalException: error unmarshalling return, Caused by: java.rmi.UnmarshalException: error unmarshalling return;.

HONG KONG – Asian shares were mixed in holiday-thinned trading on Wednesday as investors brushed off Wall Street’s latest advance into record territory. KEEPING SCORE: Japan’s benchmark Nikkei 225 index gave up early gains,

IBM WebSphere Application Server provides periodic fixes for the base and Network Deployment editions of release V8.5. The following is a complete listing of fixes.

Using Go and Scylla with the Gocql driver could be frustratingly error-prone exercise. And with no binding, you spend your time marshaling and unmarshalling data between rows and structures. In the example, we have to retrieve all the.

Oct 22, 2013. an easier tutorial for Java RMI can be found here. java.rmi. UnmarshalException: error unmarshalling return; nested exception is: java.lang.

2010年8月18日. 很久以前写了基于rmi的分布式java程序,现在基本都忘记了,只有一个大概. java. rmi.UnmarshalException: error unmarshalling return; nested.

Jun 23, 2017. UnmarshalException: Error unmarshaling return; nested exception is:. InvalidDataException (no security manager: RMI class loader disabled)

Hi I have RMI application and now I try to invoke some methods at server from my client. I have following code: public static void main(final String[] args) { try.

RECOMMENDED: Click here to fix Windows errors and improve system performance

18. October 2017 by Aaron
Categories: Articles | Comments Off on Error Unmarshalling Return Rmi

Error Sintactico Yahoo

RECOMMENDED: If you have Windows errors then we strongly recommend that you download and run this (Windows) Repair Tool.

Feb 16, 2017. prueba2: -c: línea 4: error sintáctico cerca del elemento inesperado [Yy]*' /usr/bin/ prueba: -c: línea 4: [Yy]* ) ping www.yahoo.com; break;;'.

Start your day with everything you need all in one place.

Mejor respuesta: Es un error gramatical. Saludos. un error sintáctico es la mala combinación (según reglas gramaticales establecidas, las cuales son.

Standard Error And 95 Confidence Limits Questions The 95% Confidence Interval (we show how to calculate it later) is:. number of samples n, and calculate the mean X and standard deviation s of those samples:. However, biomarkers are subject to measurement error. limit (HDL). The results showed

Para analizar una oración sintacticamente, primero se busca el verbo conjugado y se le pregunta ¿Quién? realiza la acción del verbo. Lo que.

Yahoo Answers Sign in. sintáctico repite la línea ofensiva y presenta una `flechita' que apunta al primer punto en que se ha detectado el error. La.

25 May 2013. From: Eduardo Rios <[email protected]>; Date: Sat, 25 May 2013. (0.2.2).. bash: error sintáctico cerca del elemento inesperado `('

Syntactical – definition of syntactical by The Free. – Define syntactical. syntactical synonyms, syntactical pronunciation, syntactical translation, English dictionary definition of syntactical. or syn·tac·ti·cal adj.

Python Error New-line Character Seen In Unquoted Field Ahmedabad: Cyber cell of the city crime branch on Friday arrested Babuben Thakore for killing her foster son Anil Thakore. The crime branch sources said Babuben herself, in an effort to hide the crime, had lodged a complaint with. Python

Yahoo España Respuestas. Error: escribir con letras equivocadas, omitir o agregar. Léxico:. Lenguaje lexico y sintactico?

Error Retrieving Artifact Maven cobertura-maven-plugin:2.7 or one of its dependencies could not be resolved: Could not find artifact com.sun:tools:jar:0 at [ERROR] Failed to execute goal. Jan 13, 2017  · The New York Times strives to deliver our users the best possible experience. On Android, this

Mejor respuesta: Hola Ejemplos de errores gramaticales Me dijo (de) que vendría-Correcto< me dijo que vendría> Preguntenselon a los demás Correcto.

RECOMMENDED: Click here to fix Windows errors and improve system performance

18. October 2017 by Aaron
Categories: Articles | Comments Off on Error Sintactico Yahoo

Error Code 9

RECOMMENDED: If you have Windows errors then we strongly recommend that you download and run this (Windows) Repair Tool.

Failed with result ‘exit-code’. Okt 12 17:09:38 server64 systemd[1]: Failed to start IPv4 DHCP server. — Subject: Unit dhcpd4.service has failed All works well with version 4.9.54 here. Holding back 4.9.55 for now.

0X80070021 – Find out step by step instructions on how to fix Microsoft Outlook 0X80070021 error code. The error generally shows up in Outlook 2016, Outlook 365.

Apr 8, 2015. GTA V Error code 9, Social Club failed to load. So I am trying to download the game and in a very short time this appears: "The Social Club.

Oct 06, 2017  · Hi, My Dell Inspiron has started to crash mid way into me doing thing on it, it will pop up with about 3-4 Mircosoft Windows help pages and the just close.

When I entered regsvr32 wmnetmgr.dll in the command prompt with Windows 8 to fix the error registering MSWINSCK.OCX,

One thing that is new about these is some new codes on their error messages. This has led to questions and speculations as to what is going on. host outlook-com.olc.protection.outlook.com [104.47.9.33] said: 550 5.7.1.

Ok, listen, if you get error code 80244019, at least in the case of a virus of some sort. I have been plagued with this error code for weeks.

Code Message Description Suggested fix CSS3111 "@font-face encountered unknown error" An unknown problem was encountered. character at start of numeric character reference. Expected [0-9]." HTML1401 "Unexpected character.

A complete list of system error codes, from code 1 through 15841. Here, too, are meanings for each system error code, plus other ways they may appear.

Please can someone tell me how to resolve error code 9 when trying to update after leaving the Beta programme. Thanks.

Error 9 – Page 4 – NOW TV Community – I have a android tv box with nowtv app on it, when I click on something to watch it displays error code9! What is this and how do I fix it? I've tried.

3. Tap App Search. 4. Type in Whatsapp. 5. Click install. 6. After the download and install you need to configure whatsapp. 7. Put your phone number. 8. Wait for the code. 9. Put the code in Bluestacks.

Results for Apktowin10m Error Code 9: Also try: error code 9 apple;. http://idyliq.com/q_Apktowin10m+Error+Code+9. Install Android Apps on Windows 10 Mobile.

An issue with my Comcast issued X1 Set-Top Box prevented my family and I from watching TV last night. We are shown the error code RDK-03004.

Instead of removing the editors from core, the WordPress development team has.

This man page includes most, if not all, available error codes in libcurl. Why they occur and. CURLE_REMOTE_ACCESS_DENIED (9). We were denied.

No Debugger Error Improve Computer Performance and Diagnose & Repair in Minutes. Another device told us it did not want to work with us by reporting the VK_ERROR_INCOMPATIBLE_DRIVER error. For Android development, there. Error "The debugger is not properly installed. Run setup to

Error code 9 How to fix error code 9 – Fisher and Paykel Aquasmart wl80t65c question

WordPress 4.9 is expected to be released on November. This code editor comes with syntax highlighting, code suggestions, and auto-completion. If you have.

RECOMMENDED: Click here to fix Windows errors and improve system performance

18. October 2017 by Aaron
Categories: Articles | Comments Off on Error Code 9

No Debugger Error

RECOMMENDED: If you have Windows errors then we strongly recommend that you download and run this (Windows) Repair Tool.

Improve Computer Performance and Diagnose & Repair in Minutes.

Another device told us it did not want to work with us by reporting the VK_ERROR_INCOMPATIBLE_DRIVER error. For Android development, there.

Error "The debugger is not properly installed. Run setup to install or. Initially the VS2017 IDE would not run at all due to a.DLL incompatibility.

How To Fix Debugger. Very Simple Instructions (Recommended)

My computer recently started restarting or freezing up randomly while I am not using it. I looked back through event viewer and saw bug check reboots so I ran whocrashed which game me WHEA_UNCORRECTABLE_ERROR. I am using the.

How to Debug Using GDB We are going to be using two programs to illustrate how GDB can be used to debug code. Debugging a program with a logical error

Debugging with RStudio. on the function when you no longer want to debug the function each. go to Debug -> On Error and change the value from “Error.

ERROR: Error installing debugger: ERROR: Failed to build gem native extension. That explains why debugger installs under 1.9.3, but not 2.1.1.

Debugging and authoring support. Debugging and Error Handling. In this section. Application Recovery and Restart; Error Handling; Basic Debugging; Debug Help Library;

How to fix Just-In-Time Debugging debugger. – May 01, 2012  · How to fix Just-In-Time Debugging debugger error when installing BattleField Play4Free. the following error when. debugger.

Debug/FAQ < Debug. FAQ; Developers;. FATAL ERROR in native method: JDWP No transports initialized, Here are some of the solutions to the ‘run but not debug.

In the Enable Just-In-Time debugging of these types of. This error occurs when Just-In-Time debugging tries to start Visual Studio on a machine where there is no.

Error Sintactico Yahoo Feb 16, 2017. prueba2: -c: línea 4: error sintáctico cerca del elemento inesperado [Yy]*' /usr/bin/ prueba: -c: línea 4: [Yy]* ) ping www.yahoo.com; break;;'. Start your day with everything you need all in one place. Mejor respuesta: Es un error

In this article, we will explain 10 strace command examples for troubleshooting and debugging programs and processes in a Linux system. If strace is not pre-installed on your Linux system, run the appropriate command below for your.

I attempt to start the server side of the debugger and suddenly I’m hit with an error that resembles the following, leading to the process not starting from that time forward: Error: listen EADDRINUSE 0.0.0.0:9000 at Object._errnoException.

When you try to debug an ASP.NET application running on a Web server, you may get this error message: Unable to start debugging on the Web server. Often, this error.

Jan 2, 2014. JSLint has an explicit option to tolerate debugger statements, called debug :. This error is raised to highlight a lack of convention and possible.

Standard Error And 95 Confidence Limits Questions The 95% Confidence Interval (we show how to calculate it later) is:. number of samples n, and calculate the mean X and standard deviation s of those samples:. However, biomarkers are subject to measurement error. limit (HDL). The results showed

If Mozilla Firefox or Edge is the selected browser, or the solution is launched with Ctrl-F5 without debugging then the error doesn't occur. Again.

For more information, see.WER Settings. You might see the following error messages that are associated with Just-In-Time debugging. Unable to attach to the crashing process. The specified program is not a Windows or MS-DOS.

GDB Debugger Tips. From Lazarus wiki. Jump to: navigation, search. and the app will have run as if no debugger was present. This error can happen for various reasons.

RECOMMENDED: Click here to fix Windows errors and improve system performance

18. October 2017 by Aaron
Categories: Articles | Comments Off on No Debugger Error

Sys Utl File Error

RECOMMENDED: If you have Windows errors then we strongly recommend that you download and run this (Windows) Repair Tool.

Below is the code i use to extract data from a table to a flat file. BEGIN DECLARE file_name VARCHAR2(50); file_handle utl_file.file_type; BEGIN.

No Debugger Error Improve Computer Performance and Diagnose & Repair in Minutes. Another device told us it did not want to work with us by reporting the VK_ERROR_INCOMPATIBLE_DRIVER error. For Android development, there. Error "The debugger is not properly installed. Run setup to

Looks like a read error. But at least on TOAD i am able. Can someone help me write a query using UTL_FILE or any other better way to write out this output to file system instead of outputting to TOAD. SQL> declare 2 v xmltype; 3.

ORA-29283: invalid file operation ORA-06512: at "SYS.UTL_FILE. – This code is working fine in our development database but its throwing the below error if i. ORA-29283: invalid file operation ORA-06512: at "SYS.UTL.

I am trying to write in a file stored in c:\ drive named vin1.txt and getting this error.Please suggest! > ERROR at line 1: ORA-29280: invalid > directory path.

Are you getting system errors while using Windows 10? Has Windows 10 become too slow? Are you getting files corrupted error or file is missing error after.

problem of utl file. Is there any error message? If so, which one? If you don't. Did you – as a privileged user (such as SYS) -. Code: [Select.

There are weapons and upgrade paths for the weapons and a passive attribute system in the form of complex tattoos. boss encounters making some of.

User runs a report which is configured to use Optimise2 (ERO). User receives error message. The error "ORA-29283: invalid file operation" is an Oracle-generated error.

ORACLE 11G UTL_FILE + UTL_FILE_DIR – Invalid Directory – Hi I am running Oracle 11 and I am trying to write to a directory on the server box using UTL_FILE.FOPEN. To test this I am using the following script (output.

With the UTL_FILE package, PL/SQL programs can read and write operating system text files. UTL_FILE provides a restricted version of operating system stream file I/O.

Mar 15, 2012. This PL/SQL procedure loads the graphics file on disk to a BLOB column. BEGIN Write_BLOB_To_File; END; * ERROR at line 1: ORA-29285: file write error ORA-06512: at "SYS.UTL_FILE", line 18 ORA-06512: at "SYS.

utl_file write from UNIX to Windows file – Question: I have a UNIX/Linux server and I want to use utl_file to write a flat file from the UNIX server to the remote Windows client.

Error Code 9 Failed with result ‘exit-code’. Okt 12 17:09:38 server64 systemd[1]: Failed to start IPv4 DHCP server. — Subject: Unit dhcpd4.service has failed All works well with version 4.9.54 here. Holding back 4.9.55 for now. 0X80070021 – Find out step by step

The UTL_FILE package provides the capability to read from, and write to files on the operating system's file system. GRANT EXECUTE ON PACKAGE SYS. For more information about error handling, see Section 4.5.7, Exception Handling.

Dec 8, 2015. I received this error message when I was trying to perform a data pump export of SH schema in parallel in a RAC. ORA-29283: invalid file operation ORA-06512: at "SYS.UTL_FILE", line 536 ORA-29283: invalid file operation.

Jun 14, 2004  · I am trying to generate a file using UTL_FILE in my oracle stored procedures. however I am getting an exception invalid_path. this is my code below.

I am using Oracle 11g and want to export a table using below statement C:>expdp SYS/[email protected] DIRECTORY = Mydir DUMPFILE = Customer.dmp LOGFILE =.

Hi all, I am using Oracle 10g on Windows XP. I created database with Database Configuration Assistant. It created file.

RECOMMENDED: Click here to fix Windows errors and improve system performance

18. October 2017 by Aaron
Categories: Articles | Comments Off on Sys Utl File Error

Error Retrieving Artifact Maven

RECOMMENDED: If you have Windows errors then we strongly recommend that you download and run this (Windows) Repair Tool.

cobertura-maven-plugin:2.7 or one of its dependencies could not be resolved: Could not find artifact com.sun:tools:jar:0 at [ERROR] Failed to execute goal.

Jan 13, 2017  · The New York Times strives to deliver our users the best possible experience. On Android, this means creating an offline-first, reactive architecture that.

May 22, 2017. artifact org.scala-sbt#sbt;0.13.13!sbt.jar: https://repo1.maven.org/. not found Error during sbt execution: Error retrieving required libraries.

Begin learning about Maven Repository Management, covering proxy. If the artifact is not already cached, the repository manager will retrieve the artifact from. Reap the full benefits of quality, better testing, and early error detection with.

Spring Integration Adapters, Gateways, and Channels. 06 June 2014. A community member was a little unclear on the role of Spring Integration adapters, gateways, and.

Python Error New-line Character Seen In Unquoted Field Ahmedabad: Cyber cell of the city crime branch on Friday arrested Babuben Thakore for killing her foster son Anil Thakore. The crime branch sources said Babuben herself, in an effort to hide the crime, had lodged a complaint with. Python

Sep 22, 2007. SNAPSHOT is a special version in maven that indicates the latest code; typically. Error retrieving previous build number for artifact 'com.

Bug 376785 – Maven3 build dies with remoting exception when. – Bug 376785 – Maven3 build dies with remoting exception when retrieving artifacts. Channel$ReaderThread run SEVERE: I/O error in channel. I can also see that the artifact org/kohsuke/stapler/maven-stapler-plugin/1.15/org/ kohsuke/.

This tool create an rogue Wi-Fi access point , purporting to provide wireless Internet services, but snooping on the traffic.

This compilation is dedicated to the memory of our nameless forebears, who were the inventors of the pens and inks, paper and incunabula, glyphs and alphabets,

Retrieving Maven Artifact from Repository using Maven Java. – If I have a Maven Artifact information (GroupId, ArtifactId, Version) how can I programmatically (using Java) retrieve that Artifact from my local repository?

Deploying artifacts to Nexus gives "Error retrieving. – Maven – Deploying artifacts to Nexus gives "Error retrieving previous build.". Hi all, When I deploy artifacts to nexus snapshots repository, I am getting "Error retrieving.

SemanticException Error retrieving udf. Options. Mark as New; Bookmark. META-INF/maven/com.ag2rlm/changeFormatDate/pom.xml

project xmlns="http://maven.apache.org/POM/4.0.0" xmlns. https://mvnrepository.com/artifact/org.apache.commons/commons-lang3 –> <dependency>.

Enables discovery of as many failures as possible in a single build execution with a very nice aggregated error. on artifact branch, status or other custom metadata information. Resolved dependency versions can be dynamic. Gradle.

What is Mylyn? For tutorials and articles on using Mylyn refer to the Get Started page. Mylyn is a task-focused interface for Eclipse that makes working with very.

Is there Maven support for modules? Using the standard Maven folder. The key thing to understand is that JPMS modules are not artifacts. Can we have many.

NASA’s Mars Atmosphere and Volatile Evolution (MAVEN) orbiter and Curiosity rover both observed. and it remained there as one of the institution’s most prized.

In this example, we will be discussing about how to resolve “Missing Artifact” error while using Maven. Before we start with this article, it is expected that we have a.

Error retrieving previous build number for artifact 'my.group:artifact:jar': Cannot read metadata from '/home/ci/.m2/repository/my/group/artifact/.2-SNAPSHOT/maven.

RECOMMENDED: Click here to fix Windows errors and improve system performance

18. October 2017 by Aaron
Categories: Articles | Comments Off on Error Retrieving Artifact Maven

Python Error New-line Character Seen In Unquoted Field

RECOMMENDED: If you have Windows errors then we strongly recommend that you download and run this (Windows) Repair Tool.

Ahmedabad: Cyber cell of the city crime branch on Friday arrested Babuben Thakore for killing her foster son Anil Thakore. The crime branch sources said Babuben herself, in an effort to hide the crime, had lodged a complaint with.

Python CSV error on new-line character in unquoted field. error when trying to read that file with Python: _csv.Error: new-line character seen in unquoted.

python – new-line character seen in unquoted field – Stack. – I have a file loaded in memory from a Django form. It is giving me the following error: new-line character seen in unquoted field – do you need to open the file in.

Error Creating Windows Handle Vb.net From the code, we can see that the first task is creating a UDP Client object. This is a socket that can send UDP packets. A port number is selected arbitrarily. (a) 'invalid handle' in progammers terms means an attempt

See the section on “Inheritance”. either a character vector. value for a locked field, the new value must be one of the named arguments in the initializing call. A later assignment of the field will result in an error. Class fields are inherited.

I created a python script which works with a test CSV dataset of 10 records. When I scaled this up to the actual datasets (a few thousand rows), I am getting the.

1. for i in $(ls *.mp3) One of the most common mistakes BASH programmers make is to write a loop like this: for i in $(ls *.mp3); do # Wrong!

Apr 9, 2009. When using Python 2.5's csv module, I keep running into a "new-line character seen in unquoted field" error. In [16]: f.

On reading the latest Dunlap firearms error, Ms Schmelzer, of Prairie Township, Columbus, Ohio, was alarmed that the instructor had done it again. Quoted by the news service, she questioned: ‘He’s supposed to be teaching classes.

This service pack release adds dielectric material support for Refine, a new “field_emission” example illustrating multi-PA refines and emission from curved.

A tutorial on Unix shell scripting with Bourne and Korn shells

Jul 21, 2013. This is how I avoided the above error while reading from the uploaded. as UTF- 8 for line in unicode_csv_data: yield line.encode('utf-8') def.

Jun 26, 2013. It'll be good to see the csv file itself, but this might work for you, give it a try, replace: file_read = csv.reader(self.file). with: file_read.

Washington Error Dollar Coin Would you believe some clad Washington quarters are worth more than face value, error and/or a late-stage die (meaning the die that strikes the blank coins. Error Parsing Database1.sos Error 75 Path File Access Error Lotus Notes Aug 28, 2013.

The python code I have for reading through a csv file is. Error: new-line character seen in unquoted field – do you need to open the file in.

I have a long text file with list of file masks I want to delete Example: /tmp/aaa.jpg /var/www1/* /var/www/qwerty.php I need delete them. Tried rm `cat 1.txt&#.

let’s go after everything they’ve got, let’s go after their countries, let’s trash their reputation in the field. If during your stealth operation you pwned an analyst, target him and leak his personal and professional data, as a side job of course

Python: Error: new-line character – how to open the file in universal. – Aug 22, 2013. I was playing with the CSV module from the Python standard library. Error: new -line character seen in unquoted field – do you need to open.

RECOMMENDED: Click here to fix Windows errors and improve system performance

18. October 2017 by Aaron
Categories: Articles | Comments Off on Python Error New-line Character Seen In Unquoted Field

Standard Error And 95 Confidence Limits Questions

RECOMMENDED: If you have Windows errors then we strongly recommend that you download and run this (Windows) Repair Tool.

The 95% Confidence Interval (we show how to calculate it later) is:. number of samples n, and calculate the mean X and standard deviation s of those samples:.

However, biomarkers are subject to measurement error. limit (HDL). The results showed that the performance of the.

this content; see the permissions page for details. Standard Error Questions Biology. the normal approximation than use the correct, binomial confidence limits.

Very good advices above, but it leaves the essence of the question untouched. I prefer 95%-CI because it is directly linked to p-values at 5% level. Besides, confidence interval is a product of standard error* T-student from the table with.

Budget – Assuming the combined uncertainty is normal allows us to estimate probabilities or confidence limits. For example, we can have 68 percent confidence that the.

certain questions, like. 1. 95% confidence intervals are typical but not in any way mandatory — we. standard error and that the standard error is. √ p(1−p) n.

Fortune determined the winners in the medium-sized business category (100-999 employees) according to certain criteria: 50 workplace quality questions.

Jan 05, 2012  · I have been told I am going to have to use standard error and 95% confidence limits but I do not know what this is or why you use it. Related Questions.

How to do Standard Error for A. standard error. Do this by dividing the standard deviation by. shows there is no overlap at the 95% confidence limits.

Standard Error and 95% Confidence Limits Practise Questions. Data is made up. Use standard error and 95% confidence limits to compare the heights of females and.

Margin of error = Critical value x Standard deviation of the statistic. Margin of error. What is the margin of error, assuming a 95% confidence level? (A) 0.013

Dec 01, 2014  · Standard error and 95% confidence limits tell us whether or not there is a significant difference between different sets of data. Questions. Culture.

Data were expressed as the mean ± standard error of the mean (SEM. and 90% (LC90) with their 95% confidence limits (CL) values were estimated by applying.

Statistics for Biologists – Standard Error & 95% Confidence Limits – Duration: 9:32. Mr Pollock 14,917 views. 9:32. Standard Error – Duration: 7:05.

Data Analysis, Standard Error, and Confidence Limits. the estimated standard error is. we wanted a 95% confidence interval,

Error Retrieving Artifact Maven cobertura-maven-plugin:2.7 or one of its dependencies could not be resolved: Could not find artifact com.sun:tools:jar:0 at [ERROR] Failed to execute goal. Jan 13, 2017  · The New York Times strives to deliver our users the best possible experience. On Android, this

6 days ago. This range is called the 95% confidence interval (or 95% CI). The 95% CI is related to the standard error of the mean, and for large sample.

If you know the standard deviation for a population, then you can calculate a. Your 95% confidence interval for the mean length of walleye fingerlings in this.

RECOMMENDED: Click here to fix Windows errors and improve system performance

18. October 2017 by Aaron
Categories: Articles | Comments Off on Standard Error And 95 Confidence Limits Questions

Error Creating Windows Handle Vb.net

RECOMMENDED: If you have Windows errors then we strongly recommend that you download and run this (Windows) Repair Tool.

From the code, we can see that the first task is creating a UDP Client object. This is a socket that can send UDP packets. A port number is selected arbitrarily.

(a) 'invalid handle' in progammers terms means an attempt to open a file with low -level read. Can you save a file to c: and c:windowstemp using say notepad. Create a new file called "fixexe.reg". https://www.techspot.com/vb/topic29083. html. Nero 6 "Error 6: Handle is invalid" upon installment.

Common issues when migrating from VB6 to Visual Basic.NET. By default, only the upgrade error issues are listed in the Task List. and interface definitions— To define a new interface in VB6, you had to create a new class. In the case of returning the window handle (hWnd) of a form or other control as a hWnd, you.

An unhandled exception of type 'System.ComponentModel.Win32Exception' occurred in system.windows.forms.dll Additional information: Error creating window handle. Browse more Visual Basic.NET Questions on Bytes.

Aug 27, 2013. Here are several techniques for how to handle Windows Service. This is part of a series on creating and installing Windows services. But, what happens if our service encounters an unexpected error and crashes during its run. If we instead use net start to start the service, we get the following message.

Sep 11, 2016. NET, Platform: Frameworks (XAF & XPO), Product: eXpressApp Framework, call and then handle it in a custom way: [VB.NET]Open in popup window. a custom error handling logic (e.g., creating an empty label or panel.

You have to handle this. it independently and create a completely new one. We assume this is due to the old swapchain already being invalid because the.

This is the snippet Connect and Retrieve Data in Oracle With VB.NET on FreeVBCode. The FreeVBCode site provides free Visual Basic code, examples, snippets, and.

Dynamic-link library (or DLL) is Microsoft's implementation of the shared library concept in the. NET Framework as one solution to the problems of DLL hell, although they now. The developer can catch the error and handle it appropriately. This allows the user to create a standard Windows DLL using Visual Basic.

I am currently working on a C# WPF project. I need to allow the user to create and add a scheduled task to the Windows Task Scheduler. How could I go about doing this.

CodeGuru is where developers can come to share ideas, articles, questions, answers, tips, tricks, comments, downloads, and so much more related to programming in.

Hi, I’m sorry if this request is a little off-topic. I’m creating an application for windows CE that gets the text in the URL field (which is actually a combo box) in.

Visual Basic.NET. [RESOLVED] Error creating window handle. If this is your first visit, be sure to check out the FAQ by clicking the link above. VB Code: Public Class RetrieveUserAccess.

Windows Azure – Or go all in and create your custom policy. tenant in the code as it is? An error message will appear: AADSTS50020: User account.

Washington Error Dollar Coin Would you believe some clad Washington quarters are worth more than face value, error and/or a late-stage die (meaning the die that strikes the blank coins. Error Parsing Database1.sos Error 75 Path File Access Error Lotus Notes Aug 28, 2013.

Sure, you can create custom playlists in Apple Music and. if you have.

Memory leaks; Handles and resources; Unmanaged resources. Still in Wikipedia: "Languages that provide automatic memory management, like Java, C#, VB. OutOfMemoryException with the following message: "Error creating window.

Applies To: Windows Server (Semi-Annual Channel), Windows Server 2016. Plan Group Policy Objects Decide what GPOs are required in your organization and how to create or edit the GPOs. The planning tasks do not need to be.

Experts Exchange > Questions > vb.net Error creating window handle. ? Question priority can be upgraded with a premium feature. Solved. vb.net Error creating window handle.

(Inherited from Exception.) If you are creating a Windows Presentation Foundation (WPF) application that includes printing functionality and allows print jobs to be canceled, be sure to correctly handle this exception. An unhandled.

We're working on a very large.NET WinForms composite application – not CAB, but a similar home grown framework. We're running in a Citrix and RDP environment running on Windows Server 2003. We're starting to run into random and difficult to reproduct "Error creating window handle" error that.

RECOMMENDED: Click here to fix Windows errors and improve system performance

18. October 2017 by Aaron
Categories: Articles | Comments Off on Error Creating Windows Handle Vb.net

← Older posts

Newer posts →